Reaction Details
TargetSodium channel protein type 5 subunit alpha
LigandBDBM50257064
Substrate/Competitorn/a
Meas. Tech.ChEMBL_1688710 (CHEMBL4039280)
IC50>100000±n/a nM
Citation Felts, ASRodriguez, ALBlobaum, ALMorrison, RDBates, BSThompson Gray, ARook, JMTantawy, MNByers, FWChang, SVenable, DFLuscombe, VBTamagnan, GDNiswender, CMDaniels, JSJones, CKConn, PJLindsley, CWEmmitte, KA Discovery of N-(5-Fluoropyridin-2-yl)-6-methyl-4-(pyrimidin-5-yloxy)picolinamide (VU0424238): A Novel Negative Allosteric Modulator of Metabotropic Glutamate Receptor Subtype 5 Selected for Clinical Evaluation. J Med Chem60:5072-5085 (2017) 
 
Sodium channel protein type 5 subunit alpha
Name:Sodium channel protein type 5 subunit alpha
Type:Enzyme
Mol. Mass.:226908.60
Organism:Homo sapiens (Human)
Description:Q14524
Residue:2016
BDBM50257064
NameBDBM50257064
Synonyms:CHEMBL2386850
TypeSmall organic molecule
Emp. Form.C16H12FN5O2
Mol. Mass.325.2972
SMILESCc1cc(Oc2cncnc2)cc(n1)C(=O)Nc1ccc(F)cn1