Reaction Details
TargetMetabotropic glutamate receptor 5
LigandBDBM50257087
Substrate/Competitorn/a
Meas. Tech.ChEMBL_1688689 (CHEMBL4039259)
Ki 388±n/a nM
Citation Felts, ASRodriguez, ALBlobaum, ALMorrison, RDBates, BSThompson Gray, ARook, JMTantawy, MNByers, FWChang, SVenable, DFLuscombe, VBTamagnan, GDNiswender, CMDaniels, JSJones, CKConn, PJLindsley, CWEmmitte, KA Discovery of N-(5-Fluoropyridin-2-yl)-6-methyl-4-(pyrimidin-5-yloxy)picolinamide (VU0424238): A Novel Negative Allosteric Modulator of Metabotropic Glutamate Receptor Subtype 5 Selected for Clinical Evaluation. J Med Chem60:5072-5085 (2017) 
 
Metabotropic glutamate receptor 5
Name:Metabotropic glutamate receptor 5
Type:Enzyme
Mol. Mass.:131900.14
Organism:Rattus norvegicus (Rat)
Description:P31424
Residue:1203
BDBM50257087
NameBDBM50257087
Synonyms:CHEMBL4102569
TypeSmall organic molecule
Emp. Form.C14H11N
Mol. Mass.193.2438
SMILESCc1cccnc1C#Cc1ccccc1