Reaction Details
TargetMetabotropic glutamate receptor 5
LigandBDBM50257063
Substrate/Competitorn/a
Meas. Tech.ChEMBL_1688644 (CHEMBL4039214)
IC50 9.1±n/a nM
Citation Felts, ASRodriguez, ALBlobaum, ALMorrison, RDBates, BSThompson Gray, ARook, JMTantawy, MNByers, FWChang, SVenable, DFLuscombe, VBTamagnan, GDNiswender, CMDaniels, JSJones, CKConn, PJLindsley, CWEmmitte, KA Discovery of N-(5-Fluoropyridin-2-yl)-6-methyl-4-(pyrimidin-5-yloxy)picolinamide (VU0424238): A Novel Negative Allosteric Modulator of Metabotropic Glutamate Receptor Subtype 5 Selected for Clinical Evaluation. J Med Chem60:5072-5085 (2017) 
 
Metabotropic glutamate receptor 5
Name:Metabotropic glutamate receptor 5
Type:Enzyme
Mol. Mass.:131900.14
Organism:Rattus norvegicus (Rat)
Description:P31424
Residue:1203
BDBM50257063
NameBDBM50257063
Synonyms:CHEMBL4076771
TypeSmall organic molecule
Emp. Form.C18H15FN4O2
Mol. Mass.338.3357
SMILESCc1cccc(NC(=O)c2cc(Oc3cncc(F)c3)cc(C)n2)n1