Reaction Details
TargetHistamine H2 receptor
LigandBDBM50257088
Substrate/Competitorn/a
Meas. Tech.ChEBML_1689227
Ki 443±n/a nM
Citation He, SLi, KLin, BHu, ZXiao, JHu, XWang, AQXu, XFerrer, MSouthall, NZheng, WAubé, JSchoenen, FJMarugan, JJLiang, TJFrankowski, KJ Development of an Aryloxazole Class of Hepatitis C Virus Inhibitors Targeting the Entry Stage of the Viral Replication Cycle. J Med Chem60:6364-6383 (2017) 
 
Histamine H2 receptor
Name:Histamine H2 receptor
Type:G Protein-Coupled Receptor (GPCR)
Mol. Mass.:40115.31
Organism:Homo sapiens (Human)
Description:n/a
Residue:359
BDBM50257088
NameBDBM50257088
Synonyms:CHEMBL4066784
TypeSmall organic molecule
Emp. Form.C28H41ClN4O2
Mol. Mass.501.104
SMILESC[C@H]1C[C@@H](C)CN(CCCNC(=O)C2CCN(Cc3nc(oc3C)-c3c(C)cccc3Cl)CC2)C1