Reaction Details
TargetTyrosyl-DNA phosphodiesterase 2
LigandBDBM50008923
Substrate/Competitorn/a
Meas. Tech.ChEBML_1689437
IC50>111000±n/a nM
Comments0.000 12/22/2021
Citation Elsayed, MSASu, YWang, PSethi, TAgama, KRavji, ARedon, CEKiselev, EHorzmann, KAFreeman, JLPommier, YCushman, M Design and Synthesis of Chlorinated and Fluorinated 7-Azaindenoisoquinolines as Potent Cytotoxic Anticancer Agents That Inhibit Topoisomerase I. J Med Chem60:5364-5376 (2017) 
 
Tyrosyl-DNA phosphodiesterase 2
Name:Tyrosyl-DNA phosphodiesterase 2
Type:Enzyme Catalytic Domain
Mol. Mass.:40916.54
Organism:Homo sapiens (Human)
Description:gi_23510348
Residue:362
BDBM50008923
NameBDBM50008923
Synonyms:(S)-4-ethyl-4-hydroxy-1,12-dihydro-4H-2-oxa-6,12a-diaza-dibenzo[b,h]florene-3,13-dione 4-Ethyl-4-hydroxy-1,12-dihydro-4H-2-oxa-6,12a-diaza-dibenzo[b,h]fluorene-3,13-dione 4-Ethyl-4-hydroxy-1,12-dihydro-4H-2-oxa-6,12a-diaza-dibenzo[b,h]fluorene-3,13-dione (Camptothecin) 4-ethyl-4-hydroxy-(4S)-3,4,12,14-tetrahydro-1H-pyrano[3',4':6,7]indolizino[1,2-b]quinoline-3,14-dione Camptothecin (CT) cid_24360
TypeSmall organic molecule
Emp. Form.C20H16N2O4
Mol. Mass.348.352
SMILESCC[C@@]1(O)C(=O)OCc2c1cc1-c3nc4ccccc4cc3Cn1c2=O