Reaction Details
TargetAdenosylhomocysteinase
LigandBDBM50008288
Substrate/Competitorn/a
Meas. Tech.ChEBML_196867
Ki 86.0±n/a nM
Citation Shuto, SObara, TToriya, MHosoya, MSnoeck, RAndrei, GBalzarini, JDe Clercq, E New neplanocin analogues. 1. Synthesis of 6'-modified neplanocin A derivatives as broad-spectrum antiviral agents. J Med Chem35:324-31 (1992) Adenosylhomocysteinase
Name:Adenosylhomocysteinase
Type:PROTEIN
Mol. Mass.:47687.65
Organism:Mus musculus
Description:ChEMBL_196559
Residue:432
BDBM50008288
NameBDBM50008288
Synonyms:(1S,2R,5R)-5-(6-Amino-purin-9-yl)-3-((R)-1-hydroxy-ethyl)-cyclopent-3-ene-1,2-diol CHEMBL327105
TypeSmall organic molecule
Emp. Form.C12H15N5O3
Mol. Mass.277.2792
SMILESC[C@@H](O)C1=C[C@H]([C@H](O)[C@@H]1O)n1cnc2c(N)ncnc12