Reaction Details
TargetSodium channel protein type 2 subunit alpha
LigandBDBM50257215
Substrate/Competitorn/a
Meas. Tech.ChEBML_1689557
IC50 149±n/a nM
Citation Swain, NABatchelor, DBeaudoin, SBechle, BMBradley, PABrown, ADBrown, BButcher, KJButt, RPChapman, MLDenton, SEllis, DGalan, SRGGaulier, SMGreener, BSde Groot, MJGlossop, MSGurrell, IKHannam, JJohnson, MSLin, ZMarkworth, CJMarron, BEMillan, DSNakagawa, SPike, APrintzenhoff, DRawson, DJRansley, SJReister, SMSasaki, KStorer, RIStupple, PAWest, CW Discovery of Clinical Candidate 4-[2-(5-Amino-1H-pyrazol-4-yl)-4-chlorophenoxy]-5-chloro-2-fluoro-N-1,3-thiazol-4-ylbenzenesulfonamide (PF-05089771): Design and Optimization of Diaryl Ether Aryl Sulfonamides as Selective Inhibitors of Na J Med Chem60:7029-7042 (2017) 
 
Sodium channel protein type 2 subunit alpha
Name:Sodium channel protein type 2 subunit alpha
Type:Enzyme
Mol. Mass.:227954.68
Organism:Homo sapiens (Human)
Description:Q99250
Residue:2005
BDBM50257215
NameBDBM50257215
Synonyms:CHEMBL2324411
TypeSmall organic molecule
Emp. Form.C18H13ClFN5O3S2
Mol. Mass.465.909
SMILESCn1nccc1-c1cc(Cl)ccc1Oc1ccc(cc1F)S(=O)(=O)Nc1ncns1