Reaction Details
TargetApelin receptor
LigandBDBM50257227
Substrate/Competitorn/a
Meas. Tech.ChEBML_1689663
Ki 1.000000±n/a nM
Citation McKinnie, SMKWang, WFischer, CMcDonald, TKalin, KRIturrioz, XLlorens-Cortes, COudit, GYVederas, JC Synthetic Modification within the"RPRL" Region of Apelin Peptides: Impact on Cardiovascular Activity and Stability to Neprilysin and Plasma Degradation. J Med Chem60:6408-6427 (2017) 
 
Apelin receptor
Name:Apelin receptor
Type:PROTEIN
Mol. Mass.:42351.61
Organism:Rattus norvegicus
Description:ChEMBL_10710
Residue:377
BDBM50257227
NameBDBM50257227
Synonyms:CHEMBL4085677
TypeSmall organic molecule
Emp. Form.C68H108BrN23O16
Mol. Mass.1583.634
SMILESCCCC[C@H](NC(=O)[C@@H]1CCCN1C(=O)CNC(=O)[C@H](CCCCN)NC(=O)[C@H](Cc1c[nH]cn1)NC(=O)[C@H](CO)NC(=O)[C@H](CC(C)C)NC(=O)N(CCCNC(N)=N)NC(=O)[C@@H]1CCCN1C(=O)[C@H](CCCNC(N)=N)NC(=O)[C@@H]1CCC(=O)N1)C(=O)NC(C)(C)C(=O)N[C@@H](Cc1ccc(Br)cc1)C(O)=O