Reaction Details
TargetApelin receptor
LigandBDBM50009575
Substrate/Competitorn/a
Meas. Tech.ChEBML_1689663
Ki 0.053000±n/a nM
Citation McKinnie, SMKWang, WFischer, CMcDonald, TKalin, KRIturrioz, XLlorens-Cortes, COudit, GYVederas, JC Synthetic Modification within the"RPRL" Region of Apelin Peptides: Impact on Cardiovascular Activity and Stability to Neprilysin and Plasma Degradation. J Med Chem60:6408-6427 (2017) 
 
Apelin receptor
Name:Apelin receptor
Type:PROTEIN
Mol. Mass.:42351.61
Organism:Rattus norvegicus
Description:ChEMBL_10710
Residue:377
BDBM50009575
NameBDBM50009575
Synonyms:CHEMBL3234446
TypeSmall organic molecule
Emp. Form.C96H156N34O20S
Mol. Mass.2138.547
SMILESCSCC[C@H](NC(=O)[C@@H]1CCCN1C(=O)CNC(=O)[C@H](CCCCN)NC(=O)[C@H](Cc1cnc[nH]1)NC(=O)[C@H](CO)NC(=O)[C@H](CC(C)C)NC(=O)[C@H](CCCNC(N)=N)NC(=O)[C@@H]1CCCN1C(=O)[C@H](CCCNC(N)=N)NC(=O)[C@H](CCC(N)=O)NC(=O)[C@H](CCCNC(N)=N)NC(=O)[C@H](CCCNC(N)=N)NC(=O)[C@H](Cc1ccccc1)NC(=O)[C@@H](N)CCCCN)C(=O)N1CCC[C@H]1C(=O)N[C@@H](Cc1ccccc1)C(O)=O