Reaction Details
TargetC5a anaphylatoxin chemotactic receptor 1
LigandBDBM50008383
Substrate/Competitorn/a
Meas. Tech.ChEBML_41602
Ki 220±n/a nM
Citation Or, YSClark, RFLane, BMollison, KWCarter, GWLuly, JR Improvements in the minimum binding sequence of C5a: examination of His-67. J Med Chem35:402-6 (1992) C5a anaphylatoxin chemotactic receptor 1
Name:C5a anaphylatoxin chemotactic receptor 1
Type:Enzyme
Mol. Mass.:39347.68
Organism:Homo sapiens (Human)
Description:P21730
Residue:350
BDBM50008383
NameBDBM50008383
Synonyms:CHEMBL408929 | H-Ala-Asn-Ile-Ser-Phe-Lys-AspMet-GIn-Leu-Gly-Arg-OH
TypeSmall organic molecule
Emp. Form.C59H98N18O18S
Mol. Mass.1379.584
SMILESCC[C@H](C)[C@H](NC(=O)[C@H](CC(N)=O)NC(=O)[C@H](C)N)C(=O)N[C@@H](CO)C(=O)N[C@@H](Cc1ccccc1)C(=O)N[C@@H](CCCCN)C(=O)N[C@@H](CC(O)=O)C(=O)N[C@@H](CCSC)C(=O)N[C@@H](CCC(N)=O)C(=O)N[C@@H](CC(C)C)C(=O)NCC(=O)N[C@@H](CCCNC(N)=N)C(O)=O