Reaction Details
TargetC5a anaphylatoxin chemotactic receptor 1
LigandBDBM50008380
Substrate/Competitorn/a
Meas. Tech.ChEBML_41602
Ki 36000±n/a nM
Citation Or, YSClark, RFLane, BMollison, KWCarter, GWLuly, JR Improvements in the minimum binding sequence of C5a: examination of His-67. J Med Chem35:402-6 (1992) C5a anaphylatoxin chemotactic receptor 1
Name:C5a anaphylatoxin chemotactic receptor 1
Type:Enzyme
Mol. Mass.:39347.68
Organism:Homo sapiens (Human)
Description:P21730
Residue:350
BDBM50008380
NameBDBM50008380
Synonyms:CHEMBL217002 | H-hPhe-Lys-AspMet-GIn-Leu-Gly-Arg-OH
TypeSmall organic molecule
Emp. Form.C44H73N13O12S
Mol. Mass.1008.195
SMILESCSCC[C@H](NC(=O)[C@H](CC(O)=O)NC(=O)[C@H](CCCCN)NC(=O)[C@@H](N)CCc1ccccc1)C(=O)N[C@@H](CCC(N)=O)C(=O)N[C@@H](CC(C)C)C(=O)NCC(=O)N[C@@H](CCCNC(N)=N)C(O)=O