Reaction Details
TargetBeta-adrenergic receptor kinase 1
LigandBDBM50257330
Substrate/Competitorn/a
Meas. Tech.ChEMBL_1689808 (CHEMBL4040378)
EC50 12000±n/a nM
Citation Okawa, TAramaki, YYamamoto, MKobayashi, TFukumoto, SToyoda, YHenta, THata, AIkeda, SKaneko, MHoffman, IDSang, BCZou, HKawamoto, T Design, Synthesis, and Evaluation of the Highly Selective and Potent G-Protein-Coupled Receptor Kinase 2 (GRK2) Inhibitor for the Potential Treatment of Heart Failure. J Med Chem60:6942-6990 (2017) 
 
Beta-adrenergic receptor kinase 1
Name:Beta-adrenergic receptor kinase 1
Type:Enzyme
Mol. Mass.:79581.30
Organism:Homo sapiens (Human)
Description:P25098
Residue:689
BDBM50257330
NameBDBM50257330
Synonyms:CHEMBL4071398
TypeSmall organic molecule
Emp. Form.C25H23F3N6O2
Mol. Mass.496.4843
SMILESOCCn1c(CNc2cccc(c2)C(=O)NCc2ccccc2C(F)(F)F)nnc1-c1ccncc1