Reaction Details
TargetProtein kinase C alpha type
LigandBDBM50173313
Substrate/Competitorn/a
Meas. Tech.ChEBML_1689806
IC50 250±n/a nM
Citation Okawa, TAramaki, YYamamoto, MKobayashi, TFukumoto, SToyoda, YHenta, THata, AIkeda, SKaneko, MHoffman, IDSang, BCZou, HKawamoto, T Design, Synthesis, and Evaluation of the Highly Selective and Potent G-Protein-Coupled Receptor Kinase 2 (GRK2) Inhibitor for the Potential Treatment of Heart Failure. J Med Chem60:6942-6990 (2017) 
 
Protein kinase C alpha type
Name:Protein kinase C alpha type
Type:Enzyme
Mol. Mass.:76755.65
Organism:Homo sapiens (Human)
Description:The recombinant human PKC enzymes were produced using a baculovirus expression system in SF9 cells
Residue:672
BDBM50173313
NameBDBM50173313
Synonyms:CHEMBL1738878
TypeSmall organic molecule
Emp. Form.C24H23F2N7O
Mol. Mass.463.4825
SMILESCCCn1c(CNc2cccc(c2)C(=O)NCc2c(F)cccc2F)nnc1-c1ccncn1