Reaction Details
TargetBeta-adrenergic receptor kinase 1
LigandBDBM50257424
Substrate/Competitorn/a
Meas. Tech.ChEBML_1689808
IC50 17±n/a nM
Citation Okawa, TAramaki, YYamamoto, MKobayashi, TFukumoto, SToyoda, YHenta, THata, AIkeda, SKaneko, MHoffman, IDSang, BCZou, HKawamoto, T Design, Synthesis, and Evaluation of the Highly Selective and Potent G-Protein-Coupled Receptor Kinase 2 (GRK2) Inhibitor for the Potential Treatment of Heart Failure. J Med Chem60:6942-6990 (2017) 
 
Beta-adrenergic receptor kinase 1
Name:Beta-adrenergic receptor kinase 1
Type:Enzyme
Mol. Mass.:79581.30
Organism:Homo sapiens (Human)
Description:P25098
Residue:689
BDBM50257424
NameBDBM50257424
Synonyms:CHEMBL4082853
TypeSmall organic molecule
Emp. Form.C23H22N6O2
Mol. Mass.414.4598
SMILESCOc1ccc(CNC(=O)c2cccc(NCc3nnc([nH]3)-c3ccncc3)c2)cc1