Reaction Details
TargetBeta-adrenergic receptor kinase 1
LigandBDBM50257426
Substrate/Competitorn/a
Meas. Tech.ChEMBL_1689805 (CHEMBL4040375)
IC50 3.9±n/a nM
Citation Okawa, TAramaki, YYamamoto, MKobayashi, TFukumoto, SToyoda, YHenta, THata, AIkeda, SKaneko, MHoffman, IDSang, BCZou, HKawamoto, T Design, Synthesis, and Evaluation of the Highly Selective and Potent G-Protein-Coupled Receptor Kinase 2 (GRK2) Inhibitor for the Potential Treatment of Heart Failure. J Med Chem60:6942-6990 (2017) 
 
Beta-adrenergic receptor kinase 1
Name:Beta-adrenergic receptor kinase 1
Type:Enzyme
Mol. Mass.:79581.30
Organism:Homo sapiens (Human)
Description:P25098
Residue:689
BDBM50257426
NameBDBM50257426
Synonyms:CHEMBL4077447
TypeSmall organic molecule
Emp. Form.C22H19ClN6O
Mol. Mass.418.879
SMILESClc1ccccc1CNC(=O)c1cccc(NCc2nnc([nH]2)-c2ccncc2)c1