Reaction Details
TargetBeta-adrenergic receptor kinase 1
LigandBDBM50257368
Substrate/Competitorn/a
Meas. Tech.ChEBML_1689808
IC50 53±n/a nM
Citation Okawa, TAramaki, YYamamoto, MKobayashi, TFukumoto, SToyoda, YHenta, THata, AIkeda, SKaneko, MHoffman, IDSang, BCZou, HKawamoto, T Design, Synthesis, and Evaluation of the Highly Selective and Potent G-Protein-Coupled Receptor Kinase 2 (GRK2) Inhibitor for the Potential Treatment of Heart Failure. J Med Chem60:6942-6990 (2017) 
 
Beta-adrenergic receptor kinase 1
Name:Beta-adrenergic receptor kinase 1
Type:Enzyme
Mol. Mass.:79581.30
Organism:Homo sapiens (Human)
Description:P25098
Residue:689
BDBM50257368
NameBDBM50257368
Synonyms:CHEMBL4072224
TypeSmall organic molecule
Emp. Form.C24H24N4O2
Mol. Mass.400.473
SMILESO=C(CNc1cccc(OCc2ccccc2)c1)N\N=C1/CCCc2cnccc12