Reaction Details
TargetRho-associated protein kinase 2
LigandBDBM50257389
Substrate/Competitorn/a
Meas. Tech.ChEBML_1689804
IC50 18±n/a nM
Citation Okawa, TAramaki, YYamamoto, MKobayashi, TFukumoto, SToyoda, YHenta, THata, AIkeda, SKaneko, MHoffman, IDSang, BCZou, HKawamoto, T Design, Synthesis, and Evaluation of the Highly Selective and Potent G-Protein-Coupled Receptor Kinase 2 (GRK2) Inhibitor for the Potential Treatment of Heart Failure. J Med Chem60:6942-6990 (2017) 
 
Rho-associated protein kinase 2
Name:Rho-associated protein kinase 2
Type:Protein
Mol. Mass.:160885.43
Organism:Homo sapiens (Human)
Description:O75116
Residue:1388
BDBM50257389
NameBDBM50257389
Synonyms:CHEMBL4093075
TypeSmall organic molecule
Emp. Form.C22H19ClN6O
Mol. Mass.418.879
SMILESClc1ccc(NCc2nc(n[nH]2)-c2ccncc2)cc1NC(=O)Cc1ccccc1