Reaction Details
TargetBeta-adrenergic receptor kinase 1
LigandBDBM50257378
Substrate/Competitorn/a
Meas. Tech.ChEBML_1689808
IC50 44±n/a nM
Citation Okawa, TAramaki, YYamamoto, MKobayashi, TFukumoto, SToyoda, YHenta, THata, AIkeda, SKaneko, MHoffman, IDSang, BCZou, HKawamoto, T Design, Synthesis, and Evaluation of the Highly Selective and Potent G-Protein-Coupled Receptor Kinase 2 (GRK2) Inhibitor for the Potential Treatment of Heart Failure. J Med Chem60:6942-6990 (2017) 
 
Beta-adrenergic receptor kinase 1
Name:Beta-adrenergic receptor kinase 1
Type:Enzyme
Mol. Mass.:79581.30
Organism:Homo sapiens (Human)
Description:P25098
Residue:689
BDBM50257378
NameBDBM50257378
Synonyms:CHEMBL4072686
TypeSmall organic molecule
Emp. Form.C14H14N6O2S
Mol. Mass.330.365
SMILESNS(=O)(=O)c1cccc(NCc2nc(n[nH]2)-c2ccncc2)c1