Reaction Details
TargetRho-associated protein kinase 2
LigandBDBM50257409
Substrate/Competitorn/a
Meas. Tech.ChEBML_1689804
IC50 60±n/a nM
Citation Okawa, TAramaki, YYamamoto, MKobayashi, TFukumoto, SToyoda, YHenta, THata, AIkeda, SKaneko, MHoffman, IDSang, BCZou, HKawamoto, T Design, Synthesis, and Evaluation of the Highly Selective and Potent G-Protein-Coupled Receptor Kinase 2 (GRK2) Inhibitor for the Potential Treatment of Heart Failure. J Med Chem60:6942-6990 (2017) 
 
Rho-associated protein kinase 2
Name:Rho-associated protein kinase 2
Type:Protein
Mol. Mass.:160885.43
Organism:Homo sapiens (Human)
Description:O75116
Residue:1388
BDBM50257409
NameBDBM50257409
Synonyms:CHEMBL4087117
TypeSmall organic molecule
Emp. Form.C23H21N5O
Mol. Mass.383.4457
SMILESO=C(NCc1ccccc1)c1cccc(NCc2cc(n[nH]2)-c2ccncc2)c1