Reaction Details
TargetBeta-adrenergic receptor kinase 2
LigandBDBM50257340
Substrate/Competitorn/a
Meas. Tech.ChEBML_1689810
IC50 0.650000±n/a nM
Citation Okawa, TAramaki, YYamamoto, MKobayashi, TFukumoto, SToyoda, YHenta, THata, AIkeda, SKaneko, MHoffman, IDSang, BCZou, HKawamoto, T Design, Synthesis, and Evaluation of the Highly Selective and Potent G-Protein-Coupled Receptor Kinase 2 (GRK2) Inhibitor for the Potential Treatment of Heart Failure. J Med Chem60:6942-6990 (2017) 
 
Beta-adrenergic receptor kinase 2
Name:Beta-adrenergic receptor kinase 2
Type:PROTEIN
Mol. Mass.:79721.92
Organism:Homo sapiens (Human)
Description:ChEMBL_615172
Residue:688
BDBM50257340
NameBDBM50257340
Synonyms:CHEMBL4072828
TypeSmall organic molecule
Emp. Form.C25H21F3N6O2
Mol. Mass.494.4684
SMILESFC(F)(F)c1ccccc1CNC(=O)c1cccc(NCc2nnc3-c4ccncc4OCCn23)c1