Reaction Details
TargetRho-associated protein kinase 2
LigandBDBM50257328
Substrate/Competitorn/a
Meas. Tech.ChEBML_1689804
IC50 24±n/a nM
Citation Okawa, TAramaki, YYamamoto, MKobayashi, TFukumoto, SToyoda, YHenta, THata, AIkeda, SKaneko, MHoffman, IDSang, BCZou, HKawamoto, T Design, Synthesis, and Evaluation of the Highly Selective and Potent G-Protein-Coupled Receptor Kinase 2 (GRK2) Inhibitor for the Potential Treatment of Heart Failure. J Med Chem60:6942-6990 (2017) 
 
Rho-associated protein kinase 2
Name:Rho-associated protein kinase 2
Type:Protein
Mol. Mass.:160885.43
Organism:Homo sapiens (Human)
Description:O75116
Residue:1388
BDBM50257328
NameBDBM50257328
Synonyms:CHEMBL4082775
TypeSmall organic molecule
Emp. Form.C22H20N6O
Mol. Mass.384.4338
SMILESO=C(NCc1ccccc1)c1cccc(NCc2nc(n[nH]2)-c2ccncc2)c1