Reaction Details
TargetInhibitor of nuclear factor kappa-B kinase subunit alpha
LigandBDBM50257826
Substrate/Competitorn/a
Meas. Tech.ChEBML_1690028
Ki 2400±n/a nM
Citation Anthony, NGBaiget, JBerretta, GBoyd, MBreen, DEdwards, JGamble, CGray, AIHarvey, ALHatziieremia, SHo, KHHuggan, JKLang, SLlona-Minguez, SLuo, JLMcIntosh, KPaul, APlevin, RJRobertson, MNScott, RSuckling, CJSutcliffe, OBYoung, LCMackay, SP Inhibitory Kappa B Kinase? (IKK?) Inhibitors That Recapitulate Their Selectivity in Cells against Isoform-Related Biomarkers. J Med Chem60:7043-7066 (2017) 
 
Inhibitor of nuclear factor kappa-B kinase subunit alpha
Name:Inhibitor of nuclear factor kappa-B kinase subunit alpha
Type:PROTEIN
Mol. Mass.:84642.21
Organism:Homo sapiens (Human)
Description:ChEMBL_327453
Residue:745
BDBM50257826
NameBDBM50257826
Synonyms:CHEMBL4093207
TypeSmall organic molecule
Emp. Form.C13H9N5O
Mol. Mass.251.2435
SMILESNc1nc(-c2cccc(O)c2)c2c(c[nH]c2n1)C#N