Reaction Details
TargetAcetylcholinesterase
LigandBDBM50008542
Substrate/Competitorn/a
Meas. Tech.ChEBML_29408
IC50 6.3±n/a nM
Citation Cardozo, MGIimura, YSugimoto, HYamanishi, YHopfinger, AJ QSAR analyses of the substituted indanone and benzylpiperidine rings of a series of indanone-benzylpiperidine inhibitors of acetylcholinesterase. J Med Chem35:584-9 (1992) Acetylcholinesterase
Name:Acetylcholinesterase
Type:Enzyme
Mol. Mass.:67792.70
Organism:Homo sapiens (Human)
Description:P22303
Residue:614
BDBM50008542
NameBDBM50008542
Synonyms:5,6-Diethoxy-2-methyl-indan-1-one | CHEMBL158242
TypeSmall organic molecule
Emp. Form.C14H18O3
Mol. Mass.234.2909
SMILESCCOc1cc2CC(C)C(=O)c2cc1OCC