Reaction Details
TargetAcetylcholinesterase
LigandBDBM50008556
Substrate/Competitorn/a
Meas. Tech.ChEMBL_29377 (CHEMBL648291)
IC50 2±n/a nM
Citation Cardozo, MGIimura, YSugimoto, HYamanishi, YHopfinger, AJ QSAR analyses of the substituted indanone and benzylpiperidine rings of a series of indanone-benzylpiperidine inhibitors of acetylcholinesterase. J Med Chem35:584-9 (1992) Acetylcholinesterase
Name:Acetylcholinesterase
Type:Enzyme
Mol. Mass.:67792.70
Organism:Homo sapiens (Human)
Description:P22303
Residue:614
BDBM50008556
NameBDBM50008556
Synonyms:1,3-Dimethylbenzol 3-xylene m-Xylol m-methyltoluene meta-xylene
TypeSmall organic molecule
Emp. Form.C8H10
Mol. Mass.106.165
SMILESCc1cccc(C)c1