Reaction Details
TargetAcetylcholinesterase
LigandBDBM50008582
Substrate/Competitorn/a
Meas. Tech.ChEBML_29413
IC50 5.3±n/a nM
Citation Cardozo, MGKawai, TIimura, YSugimoto, HYamanishi, YHopfinger, AJ Conformational analyses and molecular-shape comparisons of a series of indanone-benzylpiperidine inhibitors of acetylcholinesterase. J Med Chem35:590-601 (1992) Acetylcholinesterase
Name:Acetylcholinesterase
Type:Enzyme
Mol. Mass.:67792.70
Organism:Homo sapiens (Human)
Description:P22303
Residue:614
BDBM50008582
NameBDBM50008582
Synonyms:2-(1-Methyl-piperidin-4-ylmethyl)-indan-1-one | CHEMBL153865
TypeSmall organic molecule
Emp. Form.C16H21NO
Mol. Mass.243.344
SMILESCN1CCC(C[C@@H]2Cc3ccccc3C2=O)CC1