Reaction Details
TargetAcetylcholinesterase
LigandBDBM50008588
Substrate/Competitorn/a
Meas. Tech.ChEBML_29413
IC50 8.9±n/a nM
Citation Cardozo, MGKawai, TIimura, YSugimoto, HYamanishi, YHopfinger, AJ Conformational analyses and molecular-shape comparisons of a series of indanone-benzylpiperidine inhibitors of acetylcholinesterase. J Med Chem35:590-601 (1992) Acetylcholinesterase
Name:Acetylcholinesterase
Type:Enzyme
Mol. Mass.:67792.70
Organism:Homo sapiens (Human)
Description:P22303
Residue:614
BDBM50008588
NameBDBM50008588
Synonyms:1-Cyclohexylmethyl-4-methyl-piperidine | CHEMBL345241
TypeSmall organic molecule
Emp. Form.C13H25N
Mol. Mass.195.3443
SMILESCC1CCN(CC2CCCCC2)CC1