Reaction Details
TargetcGMP-dependent 3',5'-cyclic phosphodiesterase
LigandBDBM50258266
Substrate/Competitorn/a
Meas. Tech.ChEBML_1690400
IC50 53±n/a nM
Citation Mikami, SSasaki, SAsano, YUjikawa, OFukumoto, SNakashima, KOki, HKamiguchi, NImada, HIwashita, HTaniguchi, T Discovery of an Orally Bioavailable, Brain-Penetrating, in Vivo Active Phosphodiesterase 2A Inhibitor Lead Series for the Treatment of Cognitive Disorders. J Med Chem60:7658-7676 (2017) 
 
cGMP-dependent 3',5'-cyclic phosphodiesterase
Name:cGMP-dependent 3',5'-cyclic phosphodiesterase
Type:Enzyme Catalytic Domain
Mol. Mass.:105691.58
Organism:Homo sapiens (Human)
Description:O00408
Residue:941
BDBM50258266
NameBDBM50258266
Synonyms:CHEMBL4088107
TypeSmall organic molecule
Emp. Form.C18H17F3N4O2
Mol. Mass.378.3484
SMILESCCC(NC(=O)c1cnn2cc(C)cnc12)c1ccc(OC(F)(F)F)cc1