Reaction Details
Target5-hydroxytryptamine receptor 1A
LigandBDBM50258402
Substrate/Competitorn/a
Meas. Tech.ChEBML_1690518
Ki 1.8±n/a nM
Citation Bucki, AMarcinkowska, M?niecikowska, JWi?ckowski, KPaw?owski, MG?uch-Lutwin, MGrybo?, ASiwek, APytka, KJastrz?bska-Wi?sek, MPartyka, AWeso?owska, AMierzejewski, PKo?aczkowski, M Novel 3-(1,2,3,6-Tetrahydropyridin-4-yl)-1H-indole-Based Multifunctional Ligands with Antipsychotic-Like, Mood-Modulating, and Procognitive Activity. J Med Chem60:7483-7501 (2017) 
 
5-hydroxytryptamine receptor 1A
Name:5-hydroxytryptamine receptor 1A
Type:n/a
Mol. Mass.:46122.49
Organism:Homo sapiens (Human)
Description:n/a
Residue:422
BDBM50258402
NameBDBM50258402
Synonyms:CHEMBL4065568
TypeSmall organic molecule
Emp. Form.C22H24ClN3O2S
Mol. Mass.429.963
SMILESCc1cccc(c1)S(=O)(=O)NCCN1CCC(=CC1)c1c[nH]c2ccc(Cl)cc12