Reaction Details
TargetCysteine protease
LigandBDBM50258506
Substrate/Competitorn/a
Meas. Tech.ChEBML_1690561
Ki 0.500000±n/a nM
Citation Previti, SEttari, RCosconati, SAmendola, GChouchene, KWagner, AHellmich, UAUlrich, KKrauth-Siegel, RLWich, PRSchmid, ISchirmeister, TGut, JRosenthal, PJGrasso, SZappalą, M Development of Novel Peptide-Based Michael Acceptors Targeting Rhodesain and Falcipain-2 for the Treatment of Neglected Tropical Diseases (NTDs). J Med Chem60:6911-6923 (2017) 
 
Cysteine protease
Name:Cysteine protease
Synonyms:Rhodesain
Type:PROTEIN
Mol. Mass.:48425.78
Organism:Trypanosoma brucei rhodesiense
Description:ChEMBL_619861
Residue:450
BDBM50258506
NameBDBM50258506
Synonyms:CHEMBL4072275
TypeSmall organic molecule
Emp. Form.C27H34N2O4
Mol. Mass.450.5699
SMILESCC(C)C[C@H](NC(=O)OCc1ccccc1)C(=O)N[C@@H](CCc1ccccc1)\C=C\C(C)=O