Reaction Details
TargetProcathepsin L
LigandBDBM50258507
Substrate/Competitorn/a
Meas. Tech.ChEBML_1690549
Ki 0.400000±n/a nM
Citation Previti, SEttari, RCosconati, SAmendola, GChouchene, KWagner, AHellmich, UAUlrich, KKrauth-Siegel, RLWich, PRSchmid, ISchirmeister, TGut, JRosenthal, PJGrasso, SZappalą, M Development of Novel Peptide-Based Michael Acceptors Targeting Rhodesain and Falcipain-2 for the Treatment of Neglected Tropical Diseases (NTDs). J Med Chem60:6911-6923 (2017) 
 
Procathepsin L
Name:Procathepsin L
Type:Enzyme
Mol. Mass.:37557.19
Organism:Homo sapiens (Human)
Description:Purchased from Calbiochem (San Diego, CA).
Residue:333
BDBM50258507
NameBDBM50258507
Synonyms:CHEMBL4078345
TypeSmall organic molecule
Emp. Form.C30H32N2O4
Mol. Mass.484.5861
SMILESCC(=O)\C=C\[C@H](CCc1ccccc1)NC(=O)[C@H](Cc1ccccc1)NC(=O)OCc1ccccc1