Reaction Details
TargetSerine/threonine-protein kinase WNK1
LigandBDBM50258566
Substrate/Competitorn/a
Meas. Tech.ChEMBL_1690564 (CHEMBL4041134)
EC50 352±n/a nM
Citation Yamada, KLevell, JYoon, TKohls, DYowe, DRigel, DFImase, HYuan, JYasoshima, KDiPetrillo, KMonovich, LXu, LZhu, MKato, MJain, MIdamakanti, NTaslimi, PKawanami, TArgikar, UAKunjathoor, VXie, XYagi, YIIwaki, YRobinson, ZPark, HM Optimization of Allosteric With-No-Lysine (WNK) Kinase Inhibitors and Efficacy in Rodent Hypertension Models. J Med Chem60:7099-7107 (2017) 
 
Serine/threonine-protein kinase WNK1
Name:Serine/threonine-protein kinase WNK1
Type:PROTEIN
Mol. Mass.:250784.18
Organism:Homo sapiens (Human)
Description:ChEMBL_876549
Residue:2382
BDBM50258566
NameBDBM50258566
Synonyms:CHEMBL4088706
TypeSmall organic molecule
Emp. Form.C21H21Cl2N5OS
Mol. Mass.462.395
SMILESCNc1nc(cs1)-c1cc(C(=O)N2CCN(Cc3ccc(Cl)cc3)CC2)c(Cl)cn1