Reaction Details
TargetNitric oxide synthase, endothelial
LigandBDBM50258600
Substrate/Competitorn/a
Meas. Tech.ChEBML_1690597
Ki 1220±n/a nM
Citation Pensa, AVCinelli, MALi, HChreifi, GMukherjee, PRoman, LJMartásek, PPoulos, TLSilverman, RB Hydrophilic, Potent, and Selective 7-Substituted 2-Aminoquinolines as Improved Human Neuronal Nitric Oxide Synthase Inhibitors. J Med Chem60:7146-7165 (2017) 
 
Nitric oxide synthase, endothelial
Name:Nitric oxide synthase, endothelial
Type:Enzyme
Mol. Mass.:133292.26
Organism:Bos taurus (bovine)
Description:Recombinant eNOS overexpressed in E. coli was used in enzyme assays.
Residue:1205
BDBM50258600
NameBDBM50258600
Synonyms:CHEMBL4064297
TypeSmall organic molecule
Emp. Form.C20H20N4
Mol. Mass.316.3996
SMILESCc1cc(N)nc2cc(CNCCc3ccc(cc3)C#N)ccc12