Reaction Details
TargetNitric oxide synthase, endothelial
LigandBDBM50258602
Substrate/Competitorn/a
Meas. Tech.ChEBML_1690597
Ki 92±n/a nM
Citation Pensa, AVCinelli, MALi, HChreifi, GMukherjee, PRoman, LJMartásek, PPoulos, TLSilverman, RB Hydrophilic, Potent, and Selective 7-Substituted 2-Aminoquinolines as Improved Human Neuronal Nitric Oxide Synthase Inhibitors. J Med Chem60:7146-7165 (2017) 
 
Nitric oxide synthase, endothelial
Name:Nitric oxide synthase, endothelial
Type:Enzyme
Mol. Mass.:133292.26
Organism:Bos taurus (bovine)
Description:Recombinant eNOS overexpressed in E. coli was used in enzyme assays.
Residue:1205
BDBM50258602
NameBDBM50258602
Synonyms:CHEMBL4068062
TypeSmall organic molecule
Emp. Form.C20H20N4
Mol. Mass.316.3996
SMILESCc1cc(CCNCc2ccc3ccc(N)nc3c2)ccc1C#N