Reaction Details
TargetNitric oxide synthase, endothelial
LigandBDBM50258623
Substrate/Competitorn/a
Meas. Tech.ChEBML_1690597
Ki 1040±n/a nM
Citation Pensa, AVCinelli, MALi, HChreifi, GMukherjee, PRoman, LJMartásek, PPoulos, TLSilverman, RB Hydrophilic, Potent, and Selective 7-Substituted 2-Aminoquinolines as Improved Human Neuronal Nitric Oxide Synthase Inhibitors. J Med Chem60:7146-7165 (2017) 
 
Nitric oxide synthase, endothelial
Name:Nitric oxide synthase, endothelial
Type:Enzyme
Mol. Mass.:133292.26
Organism:Bos taurus (bovine)
Description:Recombinant eNOS overexpressed in E. coli was used in enzyme assays.
Residue:1205
BDBM50258623
NameBDBM50258623
Synonyms:CHEMBL4071836
TypeSmall organic molecule
Emp. Form.C18H20N4
Mol. Mass.292.3782
SMILESNc1ccc2ccc(CNCCCc3cccnc3)cc2n1