Reaction Details
TargetNitric oxide synthase, endothelial
LigandBDBM50258688
Substrate/Competitorn/a
Meas. Tech.ChEBML_1690596
Ki 1030±n/a nM
Citation Pensa, AVCinelli, MALi, HChreifi, GMukherjee, PRoman, LJMartásek, PPoulos, TLSilverman, RB Hydrophilic, Potent, and Selective 7-Substituted 2-Aminoquinolines as Improved Human Neuronal Nitric Oxide Synthase Inhibitors. J Med Chem60:7146-7165 (2017) 
 
Nitric oxide synthase, endothelial
Name:Nitric oxide synthase, endothelial
Type:Enzyme Catalytic Domain
Mol. Mass.:133297.84
Organism:Homo sapiens (Human)
Description:P29474
Residue:1203
BDBM50258688
NameBDBM50258688
Synonyms:CHEMBL4062164
TypeSmall organic molecule
Emp. Form.C19H18N4
Mol. Mass.302.373
SMILESNc1ccc2ccc(CNCCc3ccc(cc3)C#N)cc2n1