Reaction Details
TargetNitric oxide synthase, endothelial
LigandBDBM50258622
Substrate/Competitorn/a
Meas. Tech.ChEBML_1690596
Ki 1580±n/a nM
Citation Pensa, AVCinelli, MALi, HChreifi, GMukherjee, PRoman, LJMartásek, PPoulos, TLSilverman, RB Hydrophilic, Potent, and Selective 7-Substituted 2-Aminoquinolines as Improved Human Neuronal Nitric Oxide Synthase Inhibitors. J Med Chem60:7146-7165 (2017) 
 
Nitric oxide synthase, endothelial
Name:Nitric oxide synthase, endothelial
Type:Enzyme Catalytic Domain
Mol. Mass.:133297.84
Organism:Homo sapiens (Human)
Description:P29474
Residue:1203
BDBM50258622
NameBDBM50258622
Synonyms:CHEMBL4097898
TypeSmall organic molecule
Emp. Form.C19H22N4O
Mol. Mass.322.4042
SMILESCOc1ccncc1CCCNCc1ccc2ccc(N)nc2c1