Reaction Details
TargetcGMP-inhibited 3',5'-cyclic phosphodiesterase 3A
LigandBDBM50258898
Substrate/Competitorn/a
Meas. Tech.ChEMBL_1690776 (CHEMBL4041346)
IC50 8100±n/a nM
Citation Mikami, SNakamura, SAshizawa, TNomura, IKawasaki, MSasaki, SOki, HKokubo, HHoffman, IDZou, HUchiyama, NNakashima, KKamiguchi, NImada, HSuzuki, NIwashita, HTaniguchi, T Discovery of Clinical Candidate N-((1S)-1-(3-Fluoro-4-(trifluoromethoxy)phenyl)-2-methoxyethyl)-7-methoxy-2-oxo-2,3-dihydropyrido[2,3-b]pyrazine-4(1H)-carboxamide (TAK-915): A Highly Potent, Selective, and Brain-Penetrating Phosphodiesterase 2A Inhibitor for the Treatment of Cognitive Disorders. J Med Chem60:7677-7702 (2017) 
 
cGMP-inhibited 3',5'-cyclic phosphodiesterase 3A
Name:cGMP-inhibited 3',5'-cyclic phosphodiesterase 3A
Type:Enzyme
Mol. Mass.:124966.46
Organism:Homo sapiens (Human)
Description:Q14432
Residue:1141
BDBM50258898
NameBDBM50258898
Synonyms:CHEMBL4064344
TypeSmall organic molecule
Emp. Form.C18H17F3N4O3
Mol. Mass.394.3478
SMILESCCC(NC(=O)N1CC(=O)Nc2cccnc12)c1ccc(OC(F)(F)F)cc1