Reaction Details
TargetcGMP-dependent 3',5'-cyclic phosphodiesterase
LigandBDBM50258923
Substrate/Competitorn/a
Meas. Tech.ChEBML_1690806
IC50 8.7±n/a nM
Citation Mikami, SNakamura, SAshizawa, TNomura, IKawasaki, MSasaki, SOki, HKokubo, HHoffman, IDZou, HUchiyama, NNakashima, KKamiguchi, NImada, HSuzuki, NIwashita, HTaniguchi, T Discovery of Clinical Candidate N-((1S)-1-(3-Fluoro-4-(trifluoromethoxy)phenyl)-2-methoxyethyl)-7-methoxy-2-oxo-2,3-dihydropyrido[2,3-b]pyrazine-4(1H)-carboxamide (TAK-915): A Highly Potent, Selective, and Brain-Penetrating Phosphodiesterase 2A Inhibitor for the Treatment of Cognitive Disorders. J Med Chem60:7677-7702 (2017) 
 
cGMP-dependent 3',5'-cyclic phosphodiesterase
Name:cGMP-dependent 3',5'-cyclic phosphodiesterase
Type:Enzyme Catalytic Domain
Mol. Mass.:105691.58
Organism:Homo sapiens (Human)
Description:O00408
Residue:941
BDBM50258923
NameBDBM50258923
Synonyms:CHEMBL4085207
TypeSmall organic molecule
Emp. Form.C19H19F3N4O4
Mol. Mass.424.3738
SMILESCOCC(NC(=O)N1CC(=O)Nc2cc(C)cnc12)c1ccc(OC(F)(F)F)cc1