Reaction Details
TargetCarbonic anhydrase 2
LigandBDBM50258990
Substrate/Competitorn/a
Meas. Tech.ChEBML_1690988
IC50 0.799000±n/a nM
Citation Alt?ntop, MDSever, BAkal?nÇiftçi, GKucukoglu, KÖzdemir, ASoleimani, SSNadaroglu, HKaplanc?kl?, ZA Synthesis and evaluation of new benzodioxole-based dithiocarbamate derivatives as potential anticancer agents and hCA-I and hCA-II inhibitors. Eur J Med Chem125:190-196 (2017) 
 
Carbonic anhydrase 2
Name:Carbonic anhydrase 2
Type:Enzyme
Mol. Mass.:29250.71
Organism:Homo sapiens (Human)
Description:P00918
Residue:260
BDBM50258990
NameBDBM50258990
Synonyms:CHEMBL4090426
TypeSmall organic molecule
Emp. Form.C21H23N5O5S2
Mol. Mass.489.568
SMILES[O-][N+](=O)c1ccc(cc1)N1CCN(CC1)NC(=S)SCC(=O)NCc1ccc2OCOc2c1