Reaction Details
TargetCarbonic anhydrase 1
LigandBDBM50258998
Substrate/Competitorn/a
Meas. Tech.ChEBML_1690987
IC50 0.288000±n/a nM
Citation Alt?ntop, MDSever, BAkal?nÇiftçi, GKucukoglu, KÖzdemir, ASoleimani, SSNadaroglu, HKaplanc?kl?, ZA Synthesis and evaluation of new benzodioxole-based dithiocarbamate derivatives as potential anticancer agents and hCA-I and hCA-II inhibitors. Eur J Med Chem125:190-196 (2017) 
 
Carbonic anhydrase 1
Name:Carbonic anhydrase 1
Type:Enzyme
Mol. Mass.:28873.37
Organism:Homo sapiens (Human)
Description:P00915
Residue:261
BDBM50258998
NameBDBM50258998
Synonyms:CHEMBL4099344
TypeSmall organic molecule
Emp. Form.C15H19N3O3S3
Mol. Mass.385.525
SMILESO=C(CSC(=S)NN1CCSCC1)NCc1ccc2OCOc2c1