Reaction Details
TargetKappa-type opioid receptor
LigandBDBM50008899
Substrate/Competitorn/a
Meas. Tech.ChEBML_146536
Ki 1.3±n/a nM
Citation Vecchietti, VGiordani, AGiardina, GColle, RClarke, GD (2S)-1-(arylacetyl)-2-(aminomethyl)piperidine derivatives: novel, highly selective kappa opioid analgesics. J Med Chem34:397-403 (1991) Kappa-type opioid receptor
Name:Kappa-type opioid receptor
Type:G Protein-Coupled Receptor (GPCR)
Mol. Mass.:42744.99
Organism:Cavia porcellus (domestic guinea pig)
Description:P41144
Residue:380
BDBM50008899
NameBDBM50008899
Synonyms:2-(3,4-Dichloro-phenyl)-1-(2-diethylaminomethyl-piperidin-1-yl)-ethanone(HCl) | CHEMBL433849
TypeSmall organic molecule
Emp. Form.C18H26Cl2N2O
Mol. Mass.357.318
SMILESCCN(CC)CC1CCCCN1C(=O)Cc1ccc(Cl)c(Cl)c1