Reaction Details
TargetKappa-type opioid receptor
LigandBDBM50007158
Substrate/Competitorn/a
Meas. Tech.ChEBML_146536
Ki 0.240000±n/a nM
Citation Vecchietti, VGiordani, AGiardina, GColle, RClarke, GD (2S)-1-(arylacetyl)-2-(aminomethyl)piperidine derivatives: novel, highly selective kappa opioid analgesics. J Med Chem34:397-403 (1991) Kappa-type opioid receptor
Name:Kappa-type opioid receptor
Type:G Protein-Coupled Receptor (GPCR)
Mol. Mass.:42744.99
Organism:Cavia porcellus (domestic guinea pig)
Description:P41144
Residue:380
BDBM50007158
NameBDBM50007158
Synonyms:(S)-2-(3,4-Dichloro-phenyl)-1-(2-pyrrolidin-1-ylmethyl-piperidin-1-yl)-ethanone(BRL 52537) CHEMBL71294
TypeSmall organic molecule
Emp. Form.C18H24Cl2N2O
Mol. Mass.355.302
SMILESClc1ccc(CC(=O)N2CCCC[C@H]2CN2CCCC2)cc1Cl