Reaction Details
TargetMu-type opioid receptor
LigandBDBM50008888
Substrate/Competitorn/a
Meas. Tech.ChEMBL_146259 (CHEMBL757483)
Ki 464±n/a nM
Citation Vecchietti, VGiordani, AGiardina, GColle, RClarke, GD (2S)-1-(arylacetyl)-2-(aminomethyl)piperidine derivatives: novel, highly selective kappa opioid analgesics. J Med Chem34:397-403 (1991) Mu-type opioid receptor
Name:Mu-type opioid receptor
Type:Enzyme Catalytic Domain
Mol. Mass.:11165.58
Organism:GUINEA PIG
Description:P97266
Residue:98
BDBM50008888
NameBDBM50008888
Synonyms:(threo)2-(3,4-Dichloro-phenyl)-1-[2-(1-methyl-pyrrolidin-2-yl)-piperidin-1-yl]-ethanone(HCl) CHEMBL130272
TypeSmall organic molecule
Emp. Form.C18H24Cl2N2O
Mol. Mass.355.302
SMILESCN1CCCC1C1CCCCN1C(=O)Cc1ccc(Cl)c(Cl)c1