Reaction Details
TargetDelta-type opioid receptor
LigandBDBM50008888
Substrate/Competitorn/a
Meas. Tech.ChEMBL_146440 (CHEMBL757337)
Ki>10000±n/a nM
Citation Vecchietti, VGiordani, AGiardina, GColle, RClarke, GD (2S)-1-(arylacetyl)-2-(aminomethyl)piperidine derivatives: novel, highly selective kappa opioid analgesics. J Med Chem34:397-403 (1991) Delta-type opioid receptor
Name:Delta-type opioid receptor
Type:G Protein-Coupled Receptor (GPCR)
Mol. Mass.:40382.98
Organism:Homo sapiens (Human)
Description:Competition binding assays were carried out using membrane preparations from transfected HN9.10 cells that constitutively expressed the delta opioid receptor.
Residue:372
BDBM50008888
NameBDBM50008888
Synonyms:(threo)2-(3,4-Dichloro-phenyl)-1-[2-(1-methyl-pyrrolidin-2-yl)-piperidin-1-yl]-ethanone(HCl) CHEMBL130272
TypeSmall organic molecule
Emp. Form.C18H24Cl2N2O
Mol. Mass.355.302
SMILESCN1CCCC1C1CCCCN1C(=O)Cc1ccc(Cl)c(Cl)c1