Reaction Details
TargetD(3) dopamine receptor
LigandBDBM50259267
Substrate/Competitorn/a
Meas. Tech.ChEBML_1691277
Ki 0.500000±n/a nM
Citation Levoin, NLabeeuw, OBillot, XCalmels, TDanvy, DKrief, SBerrebi-Bertrand, ILecomte, JMSchwartz, JCCapet, M Discovery of nanomolar ligands with novel scaffolds for the histamine H4 receptor by virtual screening. Eur J Med Chem125:565-572 (2017) 
 
D(3) dopamine receptor
Name:D(3) dopamine receptor
Type:n/a
Mol. Mass.:44243.43
Organism:Homo sapiens (Human)
Description:n/a
Residue:400
BDBM50259267
NameBDBM50259267
Synonyms:CHEMBL4099779
TypeSmall organic molecule
Emp. Form.C27H34FN3O3
Mol. Mass.467.5756
SMILESCOc1cc2CC(C(=O)NCCCCN3CCN(CC3)c3ccccc3F)=C(C)c2cc1OC