Reaction Details
TargetD(3) dopamine receptor
LigandBDBM50259290
Substrate/Competitorn/a
Meas. Tech.ChEBML_1691277
Ki 2.8±n/a nM
Citation Levoin, NLabeeuw, OBillot, XCalmels, TDanvy, DKrief, SBerrebi-Bertrand, ILecomte, JMSchwartz, JCCapet, M Discovery of nanomolar ligands with novel scaffolds for the histamine H4 receptor by virtual screening. Eur J Med Chem125:565-572 (2017) 
 
D(3) dopamine receptor
Name:D(3) dopamine receptor
Type:n/a
Mol. Mass.:44243.43
Organism:Homo sapiens (Human)
Description:n/a
Residue:400
BDBM50259290
NameBDBM50259290
Synonyms:CHEMBL4078910
TypeSmall organic molecule
Emp. Form.C20H23BrCl2N4O
Mol. Mass.486.233
SMILESClc1cccc(N2CCN(CCCCNC(=O)c3cncc(Br)c3)CC2)c1Cl