Reaction Details
TargetHistamine H4 receptor
LigandBDBM50259294
Substrate/Competitorn/a
Meas. Tech.ChEMBL_1691275 (CHEMBL4041924)
Ki 3018±n/a nM
Citation Levoin, NLabeeuw, OBillot, XCalmels, TDanvy, DKrief, SBerrebi-Bertrand, ILecomte, JMSchwartz, JCCapet, M Discovery of nanomolar ligands with novel scaffolds for the histamine H4 receptor by virtual screening. Eur J Med Chem125:565-572 (2017) 
 
Histamine H4 receptor
Name:Histamine H4 receptor
Type:G Protein-Coupled Receptor (GPCR)
Mol. Mass.:44517.02
Organism:Homo sapiens (Human)
Description:Binding assays were using CHO cells stably expressing hH4R receptors.
Residue:390
BDBM50259294
NameBDBM50259294
Synonyms:CHEMBL4061504
TypeSmall organic molecule
Emp. Form.C24H27N3O6
Mol. Mass.453.4877
SMILES[H][C@]1(Cc2ccccc2CN(CC(=O)OCC)C1=O)NC(=O)C(Cc1ccccc1)C(=O)NO