Reaction Details
TargetDual specificity protein kinase CLK1
LigandBDBM50259405
Substrate/Competitorn/a
Meas. Tech.ChEBML_1691310
IC50 120±n/a nM
Citation Bendjeddou, LZLoaëc, NVilliers, BPrina, ESpäth, GFGalons, HMeijer, LOumata, N Exploration of the imidazo[1,2-b]pyridazine scaffold as a protein kinase inhibitor. Eur J Med Chem125:696-709 (2017) 
 
Dual specificity protein kinase CLK1
Name:Dual specificity protein kinase CLK1
Type:PROTEIN
Mol. Mass.:57124.52
Organism:Mus musculus
Description:ChEMBL_1502245
Residue:483
BDBM50259405
NameBDBM50259405
Synonyms:CHEMBL4077159
TypeSmall organic molecule
Emp. Form.C13H9ClN4O
Mol. Mass.272.69
SMILESO\N=C\c1cccc(c1)-c1cnc2ccc(Cl)nn12