Reaction Details
TargetDual specificity protein kinase CLK1
LigandBDBM50259415
Substrate/Competitorn/a
Meas. Tech.ChEBML_1691310
IC50 28±n/a nM
Citation Bendjeddou, LZLoaëc, NVilliers, BPrina, ESpäth, GFGalons, HMeijer, LOumata, N Exploration of the imidazo[1,2-b]pyridazine scaffold as a protein kinase inhibitor. Eur J Med Chem125:696-709 (2017) 
 
Dual specificity protein kinase CLK1
Name:Dual specificity protein kinase CLK1
Type:PROTEIN
Mol. Mass.:57124.52
Organism:Mus musculus
Description:ChEMBL_1502245
Residue:483
BDBM50259415
NameBDBM50259415
Synonyms:CHEMBL4061526
TypeSmall organic molecule
Emp. Form.C18H21N5O2
Mol. Mass.339.3916
SMILESCC[C@@H](CO)Nc1ccc2ncc(-c3cccc(NC(C)=O)c3)n2n1