Reaction Details
TargetDual specificity protein kinase CLK1
LigandBDBM50259526
Substrate/Competitorn/a
Meas. Tech.ChEBML_1691310
IC50 41±n/a nM
Citation Bendjeddou, LZLoaëc, NVilliers, BPrina, ESpäth, GFGalons, HMeijer, LOumata, N Exploration of the imidazo[1,2-b]pyridazine scaffold as a protein kinase inhibitor. Eur J Med Chem125:696-709 (2017) 
 
Dual specificity protein kinase CLK1
Name:Dual specificity protein kinase CLK1
Type:PROTEIN
Mol. Mass.:57124.52
Organism:Mus musculus
Description:ChEMBL_1502245
Residue:483
BDBM50259526
NameBDBM50259526
Synonyms:CHEMBL4093104
TypeSmall organic molecule
Emp. Form.C17H18N4O2
Mol. Mass.310.3504
SMILESCC[C@@H](CO)Nc1ccc2ncc(-c3cccc(C=O)c3)n2n1